Reaction Details
TargetMuscarinic acetylcholine receptor M1
LigandBDBM50011851
Substrate/Competitorn/a
Meas. Tech.ChEBML_139202
Ki 2.9±n/a nM
Citation Triggle, DJKwon, YWAbraham, PPitner, JBMascarella, SWCarroll, FI Synthesis, molecular modeling studies, and muscarinic receptor activity of azaprophen analogues. J Med Chem34:3164-71 (1991) Muscarinic acetylcholine receptor M1
Name:Muscarinic acetylcholine receptor M1
Type:Enzyme Catalytic Domain
Mol. Mass.:51390.46
Organism:RAT
Description:P08482
Residue:460
BDBM50011851
NameBDBM50011851
Synonyms:2,2-Diphenyl-propionic acid 6-methyl-6-aza-bicyclo[3.2.1]oct-3-yl ester CHEMBL287868
TypeSmall organic molecule
Emp. Form.C23H27NO2
Mol. Mass.349.466
SMILESCN1CC2CC1CC(C2)OC(=O)C(C)(c1ccccc1)c1ccccc1