Reaction Details
TargetMuscarinic acetylcholine receptor M1
LigandBDBM50368152
Substrate/Competitorn/a
Meas. Tech.ChEBML_139202
Ki 0.220000±n/a nM
Citation Triggle, DJKwon, YWAbraham, PPitner, JBMascarella, SWCarroll, FI Synthesis, molecular modeling studies, and muscarinic receptor activity of azaprophen analogues. J Med Chem34:3164-71 (1991) Muscarinic acetylcholine receptor M1
Name:Muscarinic acetylcholine receptor M1
Type:Enzyme Catalytic Domain
Mol. Mass.:51390.46
Organism:RAT
Description:P08482
Residue:460
BDBM50368152
NameBDBM50368152
Synonyms:CHEMBL318812
TypeSmall organic molecule
Emp. Form.C22H25NO3
Mol. Mass.351.4388
SMILESCN1CC2CC1CC(C2)OC(=O)C(O)(c1ccccc1)c1ccccc1