Reaction Details
TargetD(1A) dopamine receptor
LigandBDBM50453024
Substrate/Competitorn/a
Meas. Tech.ChEMBL_60185 (CHEMBL872877)
Ki 270±n/a nM
Citation Bakthavachalam, VBaindur, NMadras, BKNeumeyer, JL Fluorescent probes for dopamine receptors: synthesis and characterization of fluorescein and 7-nitrobenz-2-oxa-1,3-diazol-4-yl conjugates of D-1 and D-2 receptor ligands. J Med Chem34:3235-41 (1991) D(1A) dopamine receptor
Name:D(1A) dopamine receptor
Type:Enzyme
Mol. Mass.:49303.43
Organism:Homo sapiens (Human)
Description:P21728
Residue:446
BDBM50453024
NameBDBM50453024
Synonyms:CHEMBL2092940
TypeSmall organic molecule
Emp. Form.C22H29NO
Mol. Mass.323.4718
SMILESCCCN(CCc1ccc(C)cc1)[C@H]1CCc2c(O)cccc2C1