Reaction Details
TargetD(2) dopamine receptor
LigandBDBM50010292
Substrate/Competitorn/a
Meas. Tech.ChEBML_59152
Ki 0.660000±n/a nM
Citation Bakthavachalam, VBaindur, NMadras, BKNeumeyer, JL Fluorescent probes for dopamine receptors: synthesis and characterization of fluorescein and 7-nitrobenz-2-oxa-1,3-diazol-4-yl conjugates of D-1 and D-2 receptor ligands. J Med Chem34:3235-41 (1991) D(2) dopamine receptor
Name:D(2) dopamine receptor
Type:Cell-surface receptors
Mol. Mass.:50647.10
Organism:Homo sapiens (Human)
Description:P14416
Residue:443
BDBM50010292
NameBDBM50010292
Synonyms:8-[4-(4-Fluoro-phenyl)-4-oxo-butyl]-3-{2-[4-(7-nitro-benzo[1,2,5]oxadiazol-4-ylamino)-phenyl]-ethyl}-1-phenyl-1,3,8-triaza-spiro[4.5]decan-4-one | CHEMBL92649
TypeSmall organic molecule
Emp. Form.C37H36FN7O5
Mol. Mass.677.724
SMILES[O-][N+](=O)c1ccc(Nc2ccc(CCN3CN(c4ccccc4)C4(CCN(CCCC(=O)c5ccc(F)cc5)CC4)C3=O)cc2)c2[n-][o+]nc12