Reaction Details
TargetD(1A) dopamine receptor
LigandBDBM50010290
Substrate/Competitorn/a
Meas. Tech.ChEBML_60185
Ki 2.3±n/a nM
Citation Bakthavachalam, VBaindur, NMadras, BKNeumeyer, JL Fluorescent probes for dopamine receptors: synthesis and characterization of fluorescein and 7-nitrobenz-2-oxa-1,3-diazol-4-yl conjugates of D-1 and D-2 receptor ligands. J Med Chem34:3235-41 (1991) D(1A) dopamine receptor
Name:D(1A) dopamine receptor
Type:Enzyme
Mol. Mass.:49303.43
Organism:Homo sapiens (Human)
Description:P21728
Residue:446
BDBM50010290
NameBDBM50010290
Synonyms:5-(4-Amino-phenyl)-8-bromo-3-methyl-2,3,4,5-tetrahydro-1H-benzo[d]azepin-7-ol | CHEMBL321042
TypeSmall organic molecule
Emp. Form.C17H19BrN2O
Mol. Mass.347.25
SMILESCN1CCc2cc(Br)c(O)cc2C(C1)c1ccc(N)cc1