Reaction Details
TargetGag-Pol polyprotein [489-587]
LigandBDBM50010500
Substrate/Competitorn/a
Meas. Tech.ChEMBL_160732 (CHEMBL878991)
IC50 140±n/a nM
Citation Krohn, ARedshaw, SRitchie, JCGraves, BJHatada, MH Novel binding mode of highly potent HIV-proteinase inhibitors incorporating the (R)-hydroxyethylamine isostere. J Med Chem34:3340-2 (1991) Gag-Pol polyprotein [489-587]
Name:Gag-Pol polyprotein [489-587]
Type:Enzyme Subunit
Mol. Mass.:10781.16
Organism:Human immunodeficiency virus type 1
Description:P04585[489-587]
Residue:99
BDBM50010500
NameBDBM50010500
Synonyms:1-[3-(2-Benzyloxycarbonylamino-3-carbamoyl-propionylamino)-2-hydroxy-4-phenyl-butyl]-pyrrolidine-2-carboxylic acid tert-butyl ester CHEMBL113062
TypeSmall organic molecule
Emp. Form.C31H42N4O7
Mol. Mass.582.6878
SMILESCC(C)(C)OC(=O)[C@@H]1CCCN1C[C@@H](O)[C@H](Cc1ccccc1)NC(=O)[C@H](CC(N)=O)NC(=O)OCc1ccccc1