Reaction Details
TargetGag-Pol polyprotein [489-587]
LigandBDBM50010494
Substrate/Competitorn/a
Meas. Tech.ChEMBL_160731 (CHEMBL767110)
IC50>100±n/a nM
Citation Krohn, ARedshaw, SRitchie, JCGraves, BJHatada, MH Novel binding mode of highly potent HIV-proteinase inhibitors incorporating the (R)-hydroxyethylamine isostere. J Med Chem34:3340-2 (1991) Gag-Pol polyprotein [489-587]
Name:Gag-Pol polyprotein [489-587]
Type:Enzyme Subunit
Mol. Mass.:10781.16
Organism:Human immunodeficiency virus type 1
Description:P04585[489-587]
Residue:99
BDBM50010494
NameBDBM50010494
Synonyms:CHEMBL3350205 | N*1*-[1-Benzyl-3-(3-tert-butylcarbamoyl-octahydro-isoquinolin-2-yl)-2-hydroxy-propyl]-2-[(quinoline-2-carbonyl)-amino]-succinamide
TypeSmall organic molecule
Emp. Form.C38H50N6O5
Mol. Mass.670.8408
SMILESCC(C)(C)NC(=O)[C@@H]1CC2CCCCC2CN1C[C@H](O)[C@H](Cc1ccccc1)NC(=O)[C@H](CC(N)=O)NC(=O)c1ccc2ccccc2n1