Reaction Details
TargetD(1A) dopamine receptor
LigandBDBM50007698
Substrate/Competitorn/a
Meas. Tech.ChEBML_60356
Ki 12±n/a nM
Citation Neumeyer, JLBaindur, NNiznik, HBGuan, HCSeeman, P (+/-)-3-Allyl-6-bromo-7,8-dihydroxy-1-phenyl-2,3,4,5-tetrahydro-1H-3- benzazepin, a new high-affinity D1 dopamine receptor ligand: synthesis and structure-activity relationship. J Med Chem34:3366-71 (1992) D(1A) dopamine receptor
Name:D(1A) dopamine receptor
Type:Enzyme
Mol. Mass.:49303.43
Organism:Homo sapiens (Human)
Description:P21728
Residue:446
BDBM50007698
NameBDBM50007698
Synonyms:6-Bromo-1-phenyl-2,3,4,5-tetrahydro-1H-benzo[d]azepine-7,8-diol; hydrobromide | CHEMBL541559
TypeSmall organic molecule
Emp. Form.C16H16BrNO2
Mol. Mass.334.208
SMILESOc1cc2C(CNCCc2c(Br)c1O)c1ccccc1