Reaction Details
TargetCholesterol side-chain cleavage enzyme, mitochondrial
LigandBDBM9460
Substrate/Competitorn/a
Meas. Tech.ChEBML_82062
IC50 80000±n/a nM
Citation Browne, LJGude, CRodriguez, HSteele, REBhatnager, A Fadrozole hydrochloride: a potent, selective, nonsteroidal inhibitor of aromatase for the treatment of estrogen-dependent disease. J Med Chem34:725-36 (1991) Cholesterol side-chain cleavage enzyme, mitochondrial
Name:Cholesterol side-chain cleavage enzyme, mitochondrial
Type:PROTEIN
Mol. Mass.:60114.18
Organism:Homo sapiens (Human)
Description:ChEMBL_82062
Residue:521
BDBM9460
NameBDBM9460
Synonyms:3-(4-aminophenyl)-3-ethyl-piperidine-2,6-dione Aminoglutethimide AG, 4 Cytadren Elipten | aminoglutethimide (AG)
TypeSmall organic molecule
Emp. Form.C13H16N2O2
Mol. Mass.232.2783
SMILESCCC1(CCC(=O)NC1=O)c1ccc(N)cc1