Reaction Details
TargetAldo-keto reductase family 1 member B1
LigandBDBM50049730
Substrate/Competitorn/a
Meas. Tech.ChEMBL_32093 (CHEMBL644296)
IC50 13±n/a nM
Citation Mylari, BLBeyer, TASiegel, TW A highly specific aldose reductase inhibitor, ethyl 1-benzyl-3-hydroxy-2(5H)-oxopyrrole-4-carboxylate, and its congeners. J Med Chem34:1011-8 (1991) Aldo-keto reductase family 1 member B1
Name:Aldo-keto reductase family 1 member B1
Type:PROTEIN
Mol. Mass.:35797.87
Organism:Rattus norvegicus
Description:ChEMBL_1512484
Residue:316
BDBM50049730
NameBDBM50049730
Synonyms:2-(5-(2-methyl-3-phenylallylidene)-4-oxo-2-thioxothiazolidin-3-yl)acetic acid Epalrestat | {5-[(E)-2-Methyl-3-phenyl-prop-2-en-(Z)-ylidene]-4-oxo-2-thioxo-thiazolidin-3-yl}-acetic acid
TypeSmall organic molecule
Emp. Form.C15H13NO3S2
Mol. Mass.319.399
SMILESC\C(\C=C1/SC(=S)N(CC(O)=O)C1=O)=C/c1ccccc1