Reaction Details
TargetAdenosine receptor A2a/A2b
LigandBDBM50085667
Substrate/Competitorn/a
Meas. Tech.ChEMBL_30710 (CHEMBL645453)
Ki 9.4±n/a nM
Citation Trivedi, BKBlankley, CJBristol, JAHamilton, HWPatt, WCKramer, WJJohnson, SABruns, RFCohen, DMRyan, MJ N6-substituted adenosine receptor agonists: potential antihypertensive agents. J Med Chem34:1043-9 (1991) Adenosine receptor A2a/A2b
Name:Adenosine receptor A2a/A2b
Synonyms:Adenosine A2 receptor
Type:n/a
Mol. Mass.:n/a
Description:ASSAY_ID of ChEMBL is 30560
Components:This complex has 2 components.
Component 1
Name:Adenosine receptor A2b
Type:PROTEIN
Mol. Mass.:36378.84
Organism:Rattus norvegicus
Description:ChEMBL_32934
Residue:332
Component 2
Name:Adenosine receptor A2a
Synonyms:AA2AR_RAT Adenosine A2 receptor Adenosine Receptors A2a (A2a) Adenosine receptors A2a Rat striatal adenosine A2a receptor
Type:G Protein-Coupled Receptor (GPCR)
Mol. Mass.:45015.65
Organism:Rattus norvegicus (rat)
Description:Rat A2A receptors expressed in CHO cells.
Residue:410
BDBM50085667
NameBDBM50085667
Synonyms:(2R,3S,4R,5R)-2-Hydroxymethyl-5-{6-[(naphthalen-1-ylmethyl)-amino]-purin-9-yl}-tetrahydro-furan-3,4-diol | CHEMBL132960
TypeSmall organic molecule
Emp. Form.C21H21N5O4
Mol. Mass.407.4225
SMILESOC[C@H]1O[C@H]([C@H](O)[C@@H]1O)n1cnc2c(NCc3cccc4ccccc34)ncnc12