Reaction Details
TargetAdenosine receptor A1
LigandBDBM50368212
Substrate/Competitorn/a
Meas. Tech.ChEBML_29172
Ki 25±n/a nM
Citation Trivedi, BKBlankley, CJBristol, JAHamilton, HWPatt, WCKramer, WJJohnson, SABruns, RFCohen, DMRyan, MJ N6-substituted adenosine receptor agonists: potential antihypertensive agents. J Med Chem34:1043-9 (1991) Adenosine receptor A1
Name:Adenosine receptor A1
Type:Protein
Mol. Mass.:36704.13
Organism:Rattus norvegicus (rat)
Description:n/a
Residue:326
BDBM50368212
NameBDBM50368212
Synonyms:CHEMBL2235590 | CHEMBL604147
TypeSmall organic molecule
Emp. Form.C21H25N5O4
Mol. Mass.411.4543
SMILESOC[C@H]1O[C@H]([C@H](O)[C@@H]1O)n1cnc2c(NC3CCCc4ccccc4C3)ncnc12