Reaction Details
TargetAdenosine receptor A1
LigandBDBM50368204
Substrate/Competitorn/a
Meas. Tech.ChEBML_29172
Ki 32±n/a nM
Citation Trivedi, BKBlankley, CJBristol, JAHamilton, HWPatt, WCKramer, WJJohnson, SABruns, RFCohen, DMRyan, MJ N6-substituted adenosine receptor agonists: potential antihypertensive agents. J Med Chem34:1043-9 (1991) Adenosine receptor A1
Name:Adenosine receptor A1
Type:Protein
Mol. Mass.:36704.13
Organism:Rattus norvegicus (rat)
Description:n/a
Residue:326
BDBM50368204
NameBDBM50368204
Synonyms:CHEMBL2235596 | CHEMBL603397
TypeSmall organic molecule
Emp. Form.C19H21N5O4S
Mol. Mass.415.466
SMILESOC[C@H]1O[C@H]([C@H](O)[C@@H]1O)n1cnc2c(NC3CCSc4ccccc34)ncnc12