Reaction Details
TargetAdenosine receptor A1
LigandBDBM50368218
Substrate/Competitorn/a
Meas. Tech.ChEBML_29172
Ki 33±n/a nM
Citation Trivedi, BKBlankley, CJBristol, JAHamilton, HWPatt, WCKramer, WJJohnson, SABruns, RFCohen, DMRyan, MJ N6-substituted adenosine receptor agonists: potential antihypertensive agents. J Med Chem34:1043-9 (1991) Adenosine receptor A1
Name:Adenosine receptor A1
Type:Protein
Mol. Mass.:36704.13
Organism:Rattus norvegicus (rat)
Description:n/a
Residue:326
BDBM50368218
NameBDBM50368218
Synonyms:CHEMBL2235607 | CHEMBL603403
TypeSmall organic molecule
Emp. Form.C21H25N5O5
Mol. Mass.427.4537
SMILESCCOc1ccc2C(CCc2c1)Nc1ncnc2n(cnc12)[C@@H]1O[C@H](CO)[C@@H](O)[C@H]1O