Reaction Details
TargetD(2) dopamine receptor
LigandBDBM50007692
Substrate/Competitorn/a
Meas. Tech.ChEMBL_58709 (CHEMBL669055)
IC50 22±n/a nM
Citation Hrib, NJJurcak, JGHuger, FPErrico, CLDunn, RW Synthesis and biological evaluation of a series of substituted N-alkoxyimides and -amides as potential atypical antipsychotic agents. J Med Chem34:1068-72 (1991) D(2) dopamine receptor
Name:D(2) dopamine receptor
Type:G Protein-Coupled Receptor (GPCR)
Mol. Mass.:50931.60
Organism:Rattus norvegicus (rat)
Description:P61169
Residue:444
BDBM50007692
NameBDBM50007692
Synonyms:8-[4-(4-Benzo[d]isothiazol-3-yl-piperazin-1-yl)-butyl]-8-aza-spiro[4.5]decane-7,9-dione CHEMBL35057 | TIOSPERONE
TypeSmall organic molecule
Emp. Form.C24H32N4O2S
Mol. Mass.440.601
SMILESO=C1CC2(CCCC2)CC(=O)N1CCCCN1CCN(CC1)c1nsc2ccccc12