Reaction Details
TargetProstaglandin-H2 D-isomerase
LigandBDBM50009871
Substrate/Competitorn/a
Meas. Tech.ChEBML_158157
IC50 18±n/a nM
Citation Bell, MRD'Ambra, TEKumar, VEissenstat, MAHerrmann, JLWetzel, JRRosi, DPhilion, REDaum, SJHlasta, DJ Antinociceptive (aminoalkyl)indoles. J Med Chem34:1099-110 (1991) Prostaglandin-H2 D-isomerase
Name:Prostaglandin-H2 D-isomerase
Type:PROTEIN
Mol. Mass.:21069.88
Organism:Mus musculus
Description:ChEMBL_158158
Residue:189
BDBM50009871
NameBDBM50009871
Synonyms:Benzo[b]thiophen-3-yl-[2-methyl-1-(2-morpholin-4-yl-ethyl)-1H-indol-3-yl]-methanone | CHEMBL13288
TypeSmall organic molecule
Emp. Form.C24H24N2O2S
Mol. Mass.404.525
SMILESCc1c(C(=O)c2csc3ccccc23)c2ccccc2n1CCN1CCOCC1