Reaction Details
TargetProstaglandin-H2 D-isomerase
LigandBDBM50406486
Substrate/Competitorn/a
Meas. Tech.ChEBML_158157
IC50 160±n/a nM
Citation Bell, MRD'Ambra, TEKumar, VEissenstat, MAHerrmann, JLWetzel, JRRosi, DPhilion, REDaum, SJHlasta, DJ Antinociceptive (aminoalkyl)indoles. J Med Chem34:1099-110 (1991) Prostaglandin-H2 D-isomerase
Name:Prostaglandin-H2 D-isomerase
Type:PROTEIN
Mol. Mass.:21069.88
Organism:Mus musculus
Description:ChEMBL_158158
Residue:189
BDBM50406486
NameBDBM50406486
Synonyms:CHEMBL2092862
TypeSmall organic molecule
Emp. Form.C18H14FNO3
Mol. Mass.311.3071
SMILESC[C@H](C(O)=O)n1cc(C(=O)c2ccccc2F)c2ccccc12