Reaction Details
TargetPepsin A
LigandBDBM50011699
Substrate/Competitorn/a
Meas. Tech.ChEBML_153854
IC50 1000±n/a nM
Citation Williams, PDPerlow, DSPayne, LSHolloway, MKSiegl, PKSchorn, TWLynch, RJDoyle, JJStrouse, JFVlasuk, GP Renin inhibitors containing conformationally restricted P1-P1' dipeptide mimetics. J Med Chem34:887-900 (1991) Pepsin A
Name:Pepsin A
Type:Enzyme
Mol. Mass.:41232.87
Organism:Porcine
Description:n/a
Residue:385
BDBM50011699
NameBDBM50011699
Synonyms:CHEMBL171236 | {1-[1-[1-Cyclohexylmethyl-2-hydroxy-2-(5-methoxymethyl-1-methyl-2-oxo-pyrrolidin-3-yl)-ethylcarbamoyl]-2-(1H-imidazol-4-yl)-ethylcarbamoyl]-2-phenyl-ethyl}-carbamic acid tert-butyl ester
TypeSmall organic molecule
Emp. Form.C36H54N6O7
Mol. Mass.682.85
SMILESCOC[C@@H]1C[C@@H]([C@H](O)[C@H](CC2CCCCC2)NC(=O)[C@H](Cc2cnc[nH]2)NC(=O)[C@H](Cc2ccccc2)NC(=O)OC(C)(C)C)C(=O)N1C