Reaction Details
TargetD(2) dopamine receptor
LigandBDBM50007510
Substrate/Competitorn/a
Meas. Tech.ChEMBL_62894 (CHEMBL676133)
Ki 0.190000±n/a nM
Citation Högberg, TStröm, Pde Paulis, TStensland, BCsöregh, ILundin, KHall, HOgren, SO Potential antipsychotic agents. 9. Synthesis and stereoselective dopamine D-2 receptor blockade of a potent class of substituted (R)-N-[(1-benzyl-2-pyrrolidinyl)methyl]benzamides. Relations to other side chain congeners. J Med Chem34:948-55 (1991) D(2) dopamine receptor
Name:D(2) dopamine receptor
Type:G Protein-Coupled Receptor (GPCR)
Mol. Mass.:50931.60
Organism:Rattus norvegicus (rat)
Description:P61169
Residue:444
BDBM50007510
NameBDBM50007510
Synonyms:(R) 3-Bromo-N-[1-(4-fluoro-benzyl)-pyrrolidin-2-ylmethyl]-2-hydroxy-5,6-dimethoxy-benzamide | CHEMBL435670
TypeSmall organic molecule
Emp. Form.C21H24BrFN2O4
Mol. Mass.467.329
SMILESCOc1cc(Br)c(O)c(C(=O)NC[C@H]2CCCN2Cc2ccc(F)cc2)c1OC