Reaction Details
TargetD(2) dopamine receptor
LigandBDBM50007534
Substrate/Competitorn/a
Meas. Tech.ChEMBL_62894 (CHEMBL676133)
Ki 0.550000±n/a nM
Citation Högberg, TStröm, Pde Paulis, TStensland, BCsöregh, ILundin, KHall, HOgren, SO Potential antipsychotic agents. 9. Synthesis and stereoselective dopamine D-2 receptor blockade of a potent class of substituted (R)-N-[(1-benzyl-2-pyrrolidinyl)methyl]benzamides. Relations to other side chain congeners. J Med Chem34:948-55 (1991) D(2) dopamine receptor
Name:D(2) dopamine receptor
Type:G Protein-Coupled Receptor (GPCR)
Mol. Mass.:50931.60
Organism:Rattus norvegicus (rat)
Description:P61169
Residue:444
BDBM50007534
NameBDBM50007534
Synonyms:3-Bromo-N-((S)-1-ethyl-pyrrolidin-2-ylmethyl)-2-hydroxy-6-methoxy-benzamide A 35043 | CHEMBL283099
TypeSmall organic molecule
Emp. Form.C15H21BrN2O3
Mol. Mass.357.243
SMILESCCN1CCC[C@H]1CNC(=O)c1c(O)c(Br)ccc1OC