Reaction Details
TargetD(2) dopamine receptor
LigandBDBM50007517
Substrate/Competitorn/a
Meas. Tech.ChEMBL_62894 (CHEMBL676133)
Ki 0.064000±n/a nM
Citation Högberg, TStröm, Pde Paulis, TStensland, BCsöregh, ILundin, KHall, HOgren, SO Potential antipsychotic agents. 9. Synthesis and stereoselective dopamine D-2 receptor blockade of a potent class of substituted (R)-N-[(1-benzyl-2-pyrrolidinyl)methyl]benzamides. Relations to other side chain congeners. J Med Chem34:948-55 (1991) D(2) dopamine receptor
Name:D(2) dopamine receptor
Type:G Protein-Coupled Receptor (GPCR)
Mol. Mass.:50931.60
Organism:Rattus norvegicus (rat)
Description:P61169
Residue:444
BDBM50007517
NameBDBM50007517
Synonyms:(S)-3-bromo-N-((1-ethylpyrrolidin-2-yl)methyl)-2-hydroxy-5,6-dimethoxybenzamide CHEMBL76402
TypeSmall organic molecule
Emp. Form.C16H23BrN2O4
Mol. Mass.387.269
SMILESCCN1CCC[C@H]1CNC(=O)c1c(O)c(Br)cc(OC)c1OC