Reaction Details
TargetDelta-type opioid receptor
LigandBDBM21025
Substrate/Competitorn/a
Meas. Tech.ChEBML_147051
Ki 0.260000±n/a nM
Citation Lazarus, LHSalvadori, SSantagada, VTomatis, RWilson, WE Function of negative charge in the"address domain" of deltorphins. J Med Chem34:1350-5 (1991) Delta-type opioid receptor
Name:Delta-type opioid receptor
Type:G Protein-Coupled Receptor (GPCR)
Mol. Mass.:40465.04
Organism:Rattus norvegicus (rat)
Description:Competition binding assays were using CHO-K1 cell membranes expressing the opioid receptor.
Residue:372
BDBM21025
NameBDBM21025
Synonyms:(2R)-2-[(2S)-2-{2-[(2R)-2-[(2S)-2-amino-3-(4-hydroxyphenyl)propanamido]propanamido]acetamido}-3-phenylpropanamido]-4-methylpentanoic acid BW-180C DADLE H-Tyr-D-Ala-Gly-Phe-D-Leu-OH | [D-Ala2-D-Leu5]enkephalin
TypeANALGESIC
Emp. Form.C29H39N5O7
Mol. Mass.569.6493
SMILESCC(C)C[C@@H](NC(=O)[C@H](Cc1ccccc1)NC(=O)CNC(=O)[C@@H](C)NC(=O)[C@@H](N)Cc1ccc(O)cc1)C(O)=O