Reaction Details
TargetAcetylcholinesterase
LigandBDBM50011996
Substrate/Competitorn/a
Meas. Tech.ChEBML_27815
IC50>100000±n/a nM
Citation Cannon, JGSahin, MFBhatnagar, RKFlynn, JRLong, JP Structure-activity studies on a potent antagonist to organophosphate-induced toxicity. J Med Chem34:1582-4 (1991) Acetylcholinesterase
Name:Acetylcholinesterase
Type:Enzyme
Mol. Mass.:67659.62
Organism:Bos taurus (bovine)
Description:n/a
Residue:613
BDBM50011996
NameBDBM50011996
Synonyms:CHEMBL290329 | [1,3]Dioxan-2-ylmethyl-trimethyl-ammonium
TypeSmall organic molecule
Emp. Form.C8H18NO2
Mol. Mass.160.2335
SMILESC[N+](C)(C)CC1OCCCO1