Reaction Details
TargetAcetylcholinesterase
LigandBDBM50368269
Substrate/Competitorn/a
Meas. Tech.ChEBML_27815
IC50 6900±n/a nM
Citation Cannon, JGSahin, MFBhatnagar, RKFlynn, JRLong, JP Structure-activity studies on a potent antagonist to organophosphate-induced toxicity. J Med Chem34:1582-4 (1991) Acetylcholinesterase
Name:Acetylcholinesterase
Type:Enzyme
Mol. Mass.:67659.62
Organism:Bos taurus (bovine)
Description:n/a
Residue:613
BDBM50368269
NameBDBM50368269
Synonyms:CHEMBL1202156
TypeSmall organic molecule
Emp. Form.C32H46N2O4
Mol. Mass.522.7175
SMILESC[N+](C)(CC1CCCCO1)CC(=O)c1ccc(cc1)-c1ccc(cc1)C(=O)C[N+](C)(C)CC1CCCCO1