Reaction Details
TargetMu-type opioid receptor
LigandBDBM50451343
Substrate/Competitorn/a
Meas. Tech.ChEMBL_146263 (CHEMBL757487)
Ki 13.7±n/a nM
Citation Portoghese, PSNagase, HMaloneyHuss, KELin, CETakemori, AE Role of spacer and address components in peptidomimetic delta opioid receptor antagonists related to naltrindole. J Med Chem34:1715-20 (1991) Mu-type opioid receptor
Name:Mu-type opioid receptor
Type:Enzyme Catalytic Domain
Mol. Mass.:11165.58
Organism:GUINEA PIG
Description:P97266
Residue:98
BDBM50451343
NameBDBM50451343
Synonyms:CHEMBL477154
TypeSmall organic molecule
Emp. Form.C27H28N2O3
Mol. Mass.428.5228
SMILES[H][C@@]12Oc3c4c(C[C@@]5([H])N(CC6CC6)CC[C@@]14[C@@]5(O)Cc1c2n(C)c2ccccc12)ccc3O