Reaction Details
TargetCarbonic anhydrase 2
LigandBDBM50012214
Substrate/Competitorn/a
Meas. Tech.ChEMBL_45238 (CHEMBL658941)
Ki 9±n/a nM
Citation Prugh, JDHartman, GDMallorga, PJMcKeever, BMMichelson, SRMurcko, MASchwam, HSmith, RLSondey, JMSpringer, JP New isomeric classes of topically active ocular hypotensive carbonic anhydrase inhibitors: 5-substituted thieno[2,3-b]thiophene-2-sulfonamides and 5-substituted thieno[3,2-b]thiophene-2-sulfonamides. J Med Chem34:1805-18 (1991) Carbonic anhydrase 2
Name:Carbonic anhydrase 2
Type:Enzyme
Mol. Mass.:29250.71
Organism:Homo sapiens (Human)
Description:P00918
Residue:260
BDBM50012214
NameBDBM50012214
Synonyms:5-Sulfamoyl-thieno[2,3-b]thiophene-2-carboxylic acid bis-(2-hydroxy-ethyl)-amide | CHEMBL51097
TypeSmall organic molecule
Emp. Form.C11H14N2O5S3
Mol. Mass.350.434
SMILESNS(=O)(=O)c1cc2cc(sc2s1)C(=O)N(CCO)CCO