Reaction Details
TargetCarbonic anhydrase 2
LigandBDBM50012215
Substrate/Competitorn/a
Meas. Tech.ChEMBL_45238 (CHEMBL658941)
Ki 2.60±n/a nM
Citation Prugh, JDHartman, GDMallorga, PJMcKeever, BMMichelson, SRMurcko, MASchwam, HSmith, RLSondey, JMSpringer, JP New isomeric classes of topically active ocular hypotensive carbonic anhydrase inhibitors: 5-substituted thieno[2,3-b]thiophene-2-sulfonamides and 5-substituted thieno[3,2-b]thiophene-2-sulfonamides. J Med Chem34:1805-18 (1991) Carbonic anhydrase 2
Name:Carbonic anhydrase 2
Type:Enzyme
Mol. Mass.:29250.71
Organism:Homo sapiens (Human)
Description:P00918
Residue:260
BDBM50012215
NameBDBM50012215
Synonyms:5-{[Bis-(2-hydroxy-ethyl)-amino]-methyl}-thieno[2,3-b]thiophene-2-sulfonic acid amide; hydrochloride | CHEMBL554042
TypeSmall organic molecule
Emp. Form.C11H16N2O4S3
Mol. Mass.336.451
SMILESNS(=O)(=O)c1cc2cc(CN(CCO)CCO)sc2s1