Reaction Details
TargetCarbonic anhydrase 2
LigandBDBM50012229
Substrate/Competitorn/a
Meas. Tech.ChEMBL_45238 (CHEMBL658941)
Ki 0.44±n/a nM
Citation Prugh, JDHartman, GDMallorga, PJMcKeever, BMMichelson, SRMurcko, MASchwam, HSmith, RLSondey, JMSpringer, JP New isomeric classes of topically active ocular hypotensive carbonic anhydrase inhibitors: 5-substituted thieno[2,3-b]thiophene-2-sulfonamides and 5-substituted thieno[3,2-b]thiophene-2-sulfonamides. J Med Chem34:1805-18 (1991) Carbonic anhydrase 2
Name:Carbonic anhydrase 2
Type:Enzyme
Mol. Mass.:29250.71
Organism:Homo sapiens (Human)
Description:P00918
Residue:260
BDBM50012229
NameBDBM50012229
Synonyms:5-Thiomorpholin-4-ylmethyl-thieno[2,3-b]thiophene-2-sulfonic acid amide; hydrochloride | CHEMBL555543
TypeSmall organic molecule
Emp. Form.C11H14N2O2S4
Mol. Mass.334.501
SMILESNS(=O)(=O)c1cc2cc(CN3CCSCC3)sc2s1