Reaction Details
TargetCarbonic anhydrase 2
LigandBDBM50012236
Substrate/Competitorn/a
Meas. Tech.ChEMBL_45237 (CHEMBL658940)
Ki 2.77±n/a nM
Citation Prugh, JDHartman, GDMallorga, PJMcKeever, BMMichelson, SRMurcko, MASchwam, HSmith, RLSondey, JMSpringer, JP New isomeric classes of topically active ocular hypotensive carbonic anhydrase inhibitors: 5-substituted thieno[2,3-b]thiophene-2-sulfonamides and 5-substituted thieno[3,2-b]thiophene-2-sulfonamides. J Med Chem34:1805-18 (1991) Carbonic anhydrase 2
Name:Carbonic anhydrase 2
Type:Enzyme
Mol. Mass.:29250.71
Organism:Homo sapiens (Human)
Description:P00918
Residue:260
BDBM50012236
NameBDBM50012236
Synonyms:5-({Bis-[2-(2-methoxy-ethoxy)-ethyl]-amino}-methyl)-thieno[2,3-b]thiophene-2-sulfonic acid amide; hydrochloride | CHEMBL555548
TypeSmall organic molecule
Emp. Form.C17H28N2O6S3
Mol. Mass.452.609
SMILESCOCCOCCN(CCOCCOC)Cc1cc2cc(sc2s1)S(N)(=O)=O