Reaction Details
TargetDelta-type opioid receptor
LigandBDBM50453050
Substrate/Competitorn/a
Meas. Tech.ChEMBL_146909 (CHEMBL757497)
Ki 180±n/a nM
Citation Hruby, VJToth, GGehrig, CAKao, LFKnapp, RLui, GKYamamura, HIKramer, THDavis, PBurks, TF Topographically designed analogues of [D-Pen,D-Pen5]enkephalin. J Med Chem34:1823-30 (1991) Delta-type opioid receptor
Name:Delta-type opioid receptor
Type:G Protein-Coupled Receptor (GPCR)
Mol. Mass.:40465.04
Organism:Rattus norvegicus (rat)
Description:Competition binding assays were using CHO-K1 cell membranes expressing the opioid receptor.
Residue:372
BDBM50453050
NameBDBM50453050
Synonyms:CHEMBL2115466
TypeSmall organic molecule
Emp. Form.C31H40N6O9S2
Mol. Mass.704.814
SMILES[H][C@@]1(NC(=O)CNC(=O)[C@@H](NC(=O)[C@@H](N)Cc2ccc(O)cc2)C(C)(C)SSC(C)(C)[C@H](NC1=O)C(O)=O)[C@@H](C)c1ccc(cc1)[N+]([O-])=O