Reaction Details
Target5-hydroxytryptamine receptor 1A
LigandBDBM50010044
Substrate/Competitorn/a
Meas. Tech.ChEMBL_1149 (CHEMBL616094)
Ki 70±n/a nM
Citation Malleron, JLComte, MTGueremy, CPeyronel, JFTruchon, ABlanchard, JCDoble, APiot, OZundel, JLHuon, C Naphthosultam derivatives: a new class of potent and selective 5-HT2 antagonists. J Med Chem34:2477-83 (1991) 5-hydroxytryptamine receptor 1A
Name:5-hydroxytryptamine receptor 1A
Type:G Protein-Coupled Receptor (GPCR)
Mol. Mass.:46445.29
Organism:Rattus norvegicus (rat)
Description:Binding assays were performed using rat hippocampal membranes.
Residue:422
BDBM50010044
NameBDBM50010044
Synonyms:2-{3-[4-(4-Fluoro-phenyl)-piperazin-1-yl]-propyl}-2H-naphtho[1,8-cd]isothiazole 1,1-dioxide 2-{3-[4-(4-Fluoro-phenyl)-piperazin-1-yl]-propyl}-2H-naphtho[1,8-cd]isothiazole 1,1-dioxide(Fananserin) ChEMBL_131689 | FANANSERIN
TypeSmall organic molecule
Emp. Form.C23H24FN3O2S
Mol. Mass.425.519
SMILESFc1ccc(cc1)N1CCN(CCCN2c3cccc4cccc(c34)S2(=O)=O)CC1