Reaction Details
TargetAromatase
LigandBDBM50009430
Substrate/Competitorn/a
Meas. Tech.ChEMBL_50886 (CHEMBL664889)
Ki 228±n/a nM
Citation Numazawa, MMutsumi, AHoshi, KOshibe, MIshikawa, EKigawa, H Synthesis and biochemical studies of 16- or 19-substituted androst-4-enes as aromatase inhibitors. J Med Chem34:2496-504 (1991) Aromatase
Name:Aromatase
Type:Enzyme
Mol. Mass.:57888.92
Organism:Homo sapiens (Human)
Description:P11511
Residue:503
BDBM50009430
NameBDBM50009430
Synonyms:16-Bromo-10,13-dimethyl-1,2,3,6,7,8,9,10,11,12,13,14,15,16-tetradecahydro-cyclopenta[a]phenanthren-17-one | CHEMBL83422
TypeSmall organic molecule
Emp. Form.C19H27BrO
Mol. Mass.351.321
SMILESCC12CCC3C(CCC4=CCCCC34C)C1C[C@@H](Br)C2=O