Reaction Details
TargetCytidine deaminase
LigandBDBM50007155
Substrate/Competitorn/a
Meas. Tech.ChEBML_52540
Ki 1600000±n/a nM
Citation Lin, TSLuo, MZLiu, MCClarke-Katzenburg, RHCheng, YCPrusoff, WHMancini, WRBirnbaum, GIGabe, EJGiziewicz, J Synthesis and anticancer and antiviral activities of various 2'- and 3'-methylidene-substituted nucleoside analogues and crystal structure of 2'-deoxy-2'-methylidenecytidine hydrochloride. J Med Chem34:2607-15 (1991) Cytidine deaminase
Name:Cytidine deaminase
Type:Ezyme
Mol. Mass.:16185.04
Organism:Homo sapiens (Human)
Description:P32320
Residue:146
BDBM50007155
NameBDBM50007155
Synonyms:4-Amino-1-(3-hydroxy-5-hydroxymethyl-4-methylene-tetrahydro-furan-2-yl)-1H-pyrimidin-2-one | CHEMBL88675
TypeSmall organic molecule
Emp. Form.C10H13N3O4
Mol. Mass.239.2279
SMILESNc1ccn(C2OC(CO)C(=C)C2O)c(=O)n1