Reaction Details
TargetProtein kinase C alpha/beta/gamma type
LigandBDBM50229923
Substrate/Competitorn/a
Meas. Tech.ChEBML_152964
IC50 154000±n/a nM
Citation Shearer, BGSullivan, JPCarter, JPMathew, RMWaid, PConnor, JRPatch, RJBurch, RM Substituted 2-(aminomethyl)piperidines: a novel class of selective protein kinase C inhibitors. J Med Chem34:2928-31 (1991) Protein kinase C alpha/beta/gamma type
Name:Protein kinase C alpha/beta/gamma type
Synonyms:Protein kinase C, PKC; classical
Type:n/a
Mol. Mass.:n/a
Description:ASSAY_ID of ChEMBL is 162381
Components:This complex has 3 components.
Component 1
Name:Protein kinase C alpha type
Type:Protein
Mol. Mass.:76797.67
Organism:Rattus norvegicus (Rat)
Description:P05696
Residue:672
Component 2
Name:Protein kinase C beta type
Synonyms:KPCB_RAT Pkcb Prkcb1 Protein kinase C (PKC) | Protein kinase C beta
Type:Enzyme Mixture
Mol. Mass.:76755.54
Organism:Rattus norvegicus (rat)
Description:PKC from rat brain is known to contain predominately the conventional PKC isoforms, alpha, beta I, beta II, gamma.
Residue:671
Component 3
Name:Protein kinase C gamma type
Synonyms:KPCG_RAT Pkcg Prkcg Protein kinase C gamma
Type:PROTEIN
Mol. Mass.:78367.88
Organism:Rattus norvegicus
Description:ChEMBL_152979
Residue:697
BDBM50229923
NameBDBM50229923
Synonyms:CHEMBL317827
TypeSmall organic molecule
Emp. Form.C25H49N3O2
Mol. Mass.423.6755
SMILES[H][C@](N)(CC(C)C)C(=O)NCC1CCCCN1C(=O)CCCCCCCCCCCC