Reaction Details
TargetVasopressin V1a receptor
LigandBDBM50008085
Substrate/Competitorn/a
Meas. Tech.ChEMBL_214391 (CHEMBL819412)
Kd 76±n/a nM
Citation Barbeau, DGuay, SNeugebauer, WEscher, E Preparation and biological activities of potential vasopressin photoaffinity labels. J Med Chem35:151-7 (1992) Vasopressin V1a receptor
Name:Vasopressin V1a receptor
Type:Enzyme Catalytic Domain
Mol. Mass.:47674.81
Organism:RAT
Description:VASOPRESSIN V1A AVPR1A RAT::P30560
Residue:424
BDBM50008085
NameBDBM50008085
Synonyms:CHEMBL2028984 | [2-({1-[19-Amino-13-(4-azido-benzyl)-10-(2-carbamoyl-ethyl)-7-carbamoylmethyl-16-(4-hydroxy-benzyl)-6,9,12,15,18-pentaoxo-1,2-dithia-5,8,11,14,17-pentaaza-cycloicosane-4-carbonyl]-pyrrolidine-2-carbonyl}-amino)-5-guanidino-pentanoylamino]-acetic acid
TypeSmall organic molecule
Emp. Form.C57H82N16O12
Mol. Mass.1183.361
SMILES[#6]-[#6]-[#8]-c1ccc(-[#6]-[#6@@H](-[#7]-[#6](=O)-[#6]-c2ccncc2)-[#6](=O)-[#7]-[#6@@H](-[#6]-c2ccccc2)-[#6](=O)-[#7]-[#6@@H](-[#6](-[#6])-[#6])-[#6](=O)-[#7]-[#6@@H](-[#6]-[#6](-[#7])=O)-[#6](=O)-[#7]-[#6@@H](-[#6]-[#6])-[#6](=O)-[#7]-2-[#6]-[#6]-[#6]-[#6@H]-2-[#6](=O)-[#7]-[#6@@H](-[#6]-[#6]-[#6]\[#7]=[#6](/[#7])-[#7])-[#6](=O)-[#7]-[#6@@H](-[#6]-[#6]-[#6]\[#7]=[#6](/[#7])-[#7])-[#6](-[#8])=O)cc1