Reaction Details
TargetD(1A) dopamine receptor
LigandBDBM50368313
Substrate/Competitorn/a
Meas. Tech.ChEBML_60355
Ki 0.580000±n/a nM
Citation Baindur, NTran, MNiznik, HBGuan, HCSeeman, PNeumeyer, JL (+/-)-3-allyl-7-halo-8-hydroxy-1-phenyl-2,3,4,5-tetrahydro-1H-3-benzazepines as selective high affinity D1 dopamine receptor antagonists: synthesis and structure-activity relationship. J Med Chem35:67-72 (1992) D(1A) dopamine receptor
Name:D(1A) dopamine receptor
Type:Enzyme
Mol. Mass.:49303.43
Organism:Homo sapiens (Human)
Description:P21728
Residue:446
BDBM50368313
NameBDBM50368313
Synonyms:CHEMBL1744079
TypeSmall organic molecule
Emp. Form.C17H18BrNO
Mol. Mass.332.235
SMILESCN1CCc2cc(Br)c(O)cc2[C@H](C1)c1ccccc1