Reaction Details
TargetThermolysin
LigandBDBM50006111
Substrate/Competitorn/a
Meas. Tech.ChEBML_210389
Ki 0.068000±n/a nM
Citation Bohacek, RSMcMartin, C Definition and display of steric, hydrophobic, and hydrogen-bonding properties of ligand binding sites in proteins using Lee and Richards accessible surface: validation of a high-resolution graphical tool for drug design. J Med Chem35:1671-84 (1992) Thermolysin
Name:Thermolysin
Type:PROTEIN
Mol. Mass.:60097.54
Organism:Bacillus thermoproteolyticus
Description:ChEMBL_1468794
Residue:548
BDBM50006111
NameBDBM50006111
Synonyms:(ZFPLA) 2-[2-(2-Benzyloxycarbonylamino-3-phenyl-propionylamino)-4-methyl-pentanoylamino]-propionic acid | CHEMBL44737
TypeSmall organic molecule
Emp. Form.C26H34N3O9P
Mol. Mass.563.5366
SMILESCC(C)C[C@H](NC(=O)[C@H](Cc1ccccc1)N(C(=O)OCc1ccccc1)P(O)(O)=O)C(=O)N[C@@H](C)C(O)=O