Reaction Details
TargetThermolysin
LigandBDBM50006112
Substrate/Competitorn/a
Meas. Tech.ChEBML_210389
Ki 21300±n/a nM
Citation Bohacek, RSMcMartin, C Definition and display of steric, hydrophobic, and hydrogen-bonding properties of ligand binding sites in proteins using Lee and Richards accessible surface: validation of a high-resolution graphical tool for drug design. J Med Chem35:1671-84 (1992) Thermolysin
Name:Thermolysin
Type:PROTEIN
Mol. Mass.:60097.54
Organism:Bacillus thermoproteolyticus
Description:ChEMBL_1468794
Residue:548
BDBM50006112
NameBDBM50006112
Synonyms:((S)-1-Carbamoyl-3-methyl-butyl)-phosphoramidic acid CHEMBL47541 | N~2~-phosphono-L-leucinamide
TypeSmall organic molecule
Emp. Form.C6H15N2O4P
Mol. Mass.210.1681
SMILESCC(C)C[C@H](NP(O)(O)=O)C(N)=O