Reaction Details
TargetThermolysin
LigandBDBM21641
Substrate/Competitorn/a
Meas. Tech.ChEBML_210389
Ki 1800±n/a nM
Citation Bohacek, RSMcMartin, C Definition and display of steric, hydrophobic, and hydrogen-bonding properties of ligand binding sites in proteins using Lee and Richards accessible surface: validation of a high-resolution graphical tool for drug design. J Med Chem35:1671-84 (1992) Thermolysin
Name:Thermolysin
Type:PROTEIN
Mol. Mass.:60097.54
Organism:Bacillus thermoproteolyticus
Description:ChEMBL_1468794
Residue:548
BDBM21641
NameBDBM21641
Synonyms:2-(2-benzyl-3-sulfanylpropanamido)acetic acid Thiorphan
TypeSmall organic molecule
Emp. Form.C12H15NO3S
Mol. Mass.253.317
SMILESOC(=O)CNC(=O)C(CS)Cc1ccccc1