Reaction Details
TargetReverse transcriptase/RNaseH
LigandBDBM50002468
Substrate/Competitorn/a
Meas. Tech.ChEMBL_195520 (CHEMBL800588)
IC50 10000±n/a nM
Citation Ma, QFBathurst, ICBarr, PJKenyon, GL New thymidine triphosphate analogue inhibitors of human immunodeficiency virus-1 reverse transcriptase. J Med Chem35:1938-41 (1992) Reverse transcriptase/RNaseH
Name:Reverse transcriptase/RNaseH
Type:PROTEIN
Mol. Mass.:65229.15
Organism:Human immunodeficiency virus 1
Description:ChEMBL_1473730
Residue:566
BDBM50002468
NameBDBM50002468
Synonyms:TMPNPPthymidine 5'-[alpha,beta-imido]triphosphate
TypeSmall organic molecule
Emp. Form.C9H12N3O13P3
Mol. Mass.463.1274
SMILESCc1cn([C@H]2C[C@@H](O)[C@@H](OP([O-])(=O)NP([O-])(=O)OP([O-])([O-])=O)O2)c(=O)[nH]c1=O