Reaction Details
TargetCholecystokinin receptor type A
LigandBDBM50002514
Substrate/Competitorn/a
Meas. Tech.ChEBML_49717
IC50 2.9±n/a nM
Citation Shiosaki, KLin, CWKopecka, HCraig, RABianchi, BRMiller, TRWitte, DGStashko, MNadzan, AM Development of potent and selective CCK-A receptor agonists from Boc-CCK-4: tetrapeptides containing Lys(N epsilon)-amide residues. J Med Chem35:2007-14 (1992) Cholecystokinin receptor type A
Name:Cholecystokinin receptor type A
Type:n/a
Mol. Mass.:48229.77
Organism:Cavia porcellus
Description:n/a
Residue:430
BDBM50002514
NameBDBM50002514
Synonyms:3-{2-[2-tert-Butoxycarbonylamino-3-(1H-indol-3-yl)-propionylamino]-6-[(6-sulfo-naphthalene-2-carbonyl)-amino]-hexanoylamino}-N-(1-carbamoyl-2-phenyl-ethyl)-succinamic acid.NH4OH; hydrate | CHEMBL62345
TypeSmall organic molecule
Emp. Form.C46H53N7O13S
Mol. Mass.944.017
SMILESCC(C)(C)OC(=O)N[C@@H](Cc1c[nH]c2ccccc12)C(=O)N[C@@H](CCCCNC(=O)c1ccc2cc(OS(O)(=O)=O)ccc2c1)C(=O)N[C@@H](CC(O)=O)C(=O)N[C@@H](Cc1ccccc1)C(N)=O