Reaction Details
TargetIntegrin alpha-IIb/beta-3
LigandBDBM50006349
Substrate/Competitorn/a
Meas. Tech.ChEMBL_70331 (CHEMBL678836)
IC50 2.5±n/a nM
Citation Barker, PLBullens, SBunting, SBurdick, DJChan, KSDeisher, TEigenbrot, CGadek, TRGantzos, RLipari, MT Cyclic RGD peptide analogues as antiplatelet antithrombotics. J Med Chem35:2040-8 (1992) Integrin alpha-IIb/beta-3
Name:Integrin alpha-IIb/beta-3
Synonyms:Glycoprotein IIb/IIIa
Type:n/a
Mol. Mass.:n/a
Description:ASSAY_ID of EBI is 30109
Components:This complex has 2 components.
Component 1
Name:Integrin beta-3
Type:Protein
Mol. Mass.:87038.91
Organism:Homo sapiens (Human)
Description:P05106
Residue:788
Component 2
Name:Integrin alpha-IIb
Synonyms:CD_antigen=CD41 GPIIb Glycoprotein IIb ITGA2B Integrin alpha-IIb heavy chain Integrin alpha-IIb light chain, form 2 Integrin alpha-V/beta-3 and alpha-IIb/beta 3 | Platelet membrane glycoprotein IIb
Type:Protein
Mol. Mass.:113354.85
Organism:Homo sapiens (Human)
Description:P08514
Residue:1039
BDBM50006349
NameBDBM50006349
Synonyms:CHEMBL64787 | [3-Carbamoyl-12-(3-guanidino-propyl)-15-(4-hydroxy-benzyl)-5,8,11,14,17-pentaoxo-1-thia-4,7,10,13,16-pentaaza-cyclooctadec-6-yl]-acetic acid
TypeSmall organic molecule
Emp. Form.C26H37N9O9S
Mol. Mass.651.692
SMILESNC(=N)NCCC[C@@H]1NC(=O)[C@H](Cc2ccc(O)cc2)NC(=O)CSC[C@H](NC(=O)[C@H](CC(O)=O)NC(=O)CNC1=O)C(N)=O