Reaction Details
TargetHistamine H1 receptor
LigandBDBM50002094
Substrate/Competitorn/a
Meas. Tech.ChEBML_83429
Ki 29±n/a nM
Citation Ohshima, EOtaki, SSato, HKumazawa, TObase, HIshii, AIshii, HOhmori, KHirayama, N Synthesis and antiallergic activity of 11-(aminoalkylidene)-6,11-dihydrodibenz[b,e]oxepin derivatives. J Med Chem35:2074-84 (1992) Histamine H1 receptor
Name:Histamine H1 receptor
Type:G Protein-Coupled Receptor (GPCR)
Mol. Mass.:55641.53
Organism:Cavia porcellus (domestic guinea pig)
Description:Guinea pig cerebellum was used in binding assay.
Residue:488
BDBM50002094
NameBDBM50002094
Synonyms:3-[11-(3-Dimethylamino-propylidene)-6,11-dihydro-dibenzo[b,e]oxepin-2-yl]-acrylic acid; compound with but-2-enedioic acid | CHEMBL264979
TypeSmall organic molecule
Emp. Form.C22H23NO3
Mol. Mass.349.4229
SMILESCN(C)CC\C=C1\c2ccccc2COc2ccc(\C=C\C(O)=O)cc12