Reaction Details
TargetKappa-type opioid receptor
LigandBDBM50000784
Substrate/Competitorn/a
Meas. Tech.ChEBML_220941
Ki 1.5±n/a nM
Citation Cheng, CYWu, SCHsin, LWTam, SW Selective reversible and irreversible ligands for the kappa opioid receptor. J Med Chem35:2243-7 (1992) Kappa-type opioid receptor
Name:Kappa-type opioid receptor
Type:G Protein-Coupled Receptor (GPCR)
Mol. Mass.:42744.99
Organism:Cavia porcellus (domestic guinea pig)
Description:P41144
Residue:380
BDBM50000784
NameBDBM50000784
Synonyms:2-(3,4-Dichloro-phenyl)-N-methyl-N-(7-pyrrolidin-1-yl-1,4-dioxa-spiro[4.5]dec-8-yl)-acetamide | CHEMBL73226
TypeSmall organic molecule
Emp. Form.C21H28Cl2N2O3
Mol. Mass.427.365
SMILESCN([C@H]1CCC2(C[C@@H]1N1CCCC1)OCCO2)C(=O)Cc1ccc(Cl)c(Cl)c1