Reaction Details
TargetVoltage-dependent L-type calcium channel subunit alpha-1C
LigandBDBM50002643
Substrate/Competitorn/a
Meas. Tech.ChEBML_164619
IC50 10±n/a nM
Citation Sunkel, CEFau de Casa-Juana, MSantos, LGarcía, AGArtalejo, CRVillarroya, MGonzález-Morales, MALópez, MGCillero, JAlonso, S Synthesis of 3-[(2,3-dihydro-1,1,3-trioxo-1,2-benzisothiazol-2-yl)alkyl] 1,4-dihydropyridine-3,5-dicarboxylate derivatives as calcium channel modulators. J Med Chem35:2407-14 (1992) Voltage-dependent L-type calcium channel subunit alpha-1C
Name:Voltage-dependent L-type calcium channel subunit alpha-1C
Type:PROTEIN
Mol. Mass.:242793.78
Organism:Oryctolagus cuniculus
Description:ChEMBL_42776
Residue:2171
BDBM50002643
NameBDBM50002643
Synonyms:4-(2-Chloro-phenyl)-2,6-dimethyl-1,4-dihydro-pyridine-3,5-dicarboxylic acid 3-(tetrahydro-furan-2-ylmethyl) ester 5-(1,1,3-trioxo-1,3-dihydro-1lambda*6*-benzo[d]isothiazol-2-ylmethyl) ester | CHEMBL79740
TypeSmall organic molecule
Emp. Form.C28H27ClN2O8S
Mol. Mass.587.041
SMILESCC1=NC(C)=C(C(C1C(=O)OCC1CCCO1)c1ccccc1Cl)C(=O)OCN1C(=O)c2ccccc2S1(=O)=O