Reaction Details
TargetCholecystokinin receptor type A
LigandBDBM81962
Substrate/Competitorn/a
Meas. Tech.ChEBML_49401
IC50 230±n/a nM
Citation Drysdale, MJPritchard, MCHorwell, DC Rationally designed"dipeptoid" analogues of CCK. Acid mimics of the potent and selective non-peptide CCK-B receptor antagonist CI-988. J Med Chem35:2573-81 (1992) Cholecystokinin receptor type A
Name:Cholecystokinin receptor type A
Type:Enzyme Catalytic Domain
Mol. Mass.:49676.37
Organism:RAT
Description:Cholecystokinin central 0 RAT::P30551
Residue:444
BDBM81962
NameBDBM81962
Synonyms:S-L-365,260
Typen/a
Emp. Form.C24H22N4O2
Mol. Mass.398.4571
SMILESCN1c2ccccc2C(=N[C@@H](NC(=O)Nc2cccc(C)c2)C1=O)c1ccccc1