Reaction Details
TargetPolyunsaturated fatty acid 5-lipoxygenase
LigandBDBM50000847
Substrate/Competitorn/a
Meas. Tech.ChEBML_3807
IC50 30±n/a nM
Citation Crawley, GCDowell, RIEdwards, PNFoster, SJMcMillan, RMWalker, ERWaterson, DBird, TGBruneau, PGiroaeau, JM Methoxytetrahydropyrans. A new series of selective and orally potent 5-lipoxygenase inhibitors. J Med Chem35:2600-9 (1992) Polyunsaturated fatty acid 5-lipoxygenase
Name:Polyunsaturated fatty acid 5-lipoxygenase
Type:Enzyme
Mol. Mass.:77972.74
Organism:Homo sapiens (Human)
Description:Recombinant protein was purified from E. coli lysate. After ammonium sulfate precipitation and subsequent steps, the supernatant (S100) was used for 5-LO activity assay.
Residue:674
BDBM50000847
NameBDBM50000847
Synonyms:6-[3-(4-Methoxy-tetrahydro-pyran-4-yl)-phenoxymethyl]-1-methyl-1H-quinolin-2-one (0.8 hydrate) | CHEMBL316091
TypeSmall organic molecule
Emp. Form.C23H25NO4
Mol. Mass.379.4489
SMILESCOC1(CCOCC1)c1cccc(OCc2ccc3n(C)c(=O)ccc3c2)c1