Reaction Details
TargetMu-type opioid receptor
LigandBDBM50001026
Substrate/Competitorn/a
Meas. Tech.ChEBML_146540
Ki 5.1±n/a nM
Citation Carroll, FIAbraham, PParham, KBai, XZhang, XBrine, GAMascarella, SWMartin, BRMay, ELSauss, C Enantiomeric N-substituted N-normetazocines: a comparative study of affinities at sigma, PCP, and mu opioid receptors. J Med Chem35:2812-8 (1992) Mu-type opioid receptor
Name:Mu-type opioid receptor
Type:G Protein-Coupled Receptor (GPCR)
Mol. Mass.:44503.11
Organism:Rattus norvegicus (rat)
Description:Competition binding assays were carried out using membrane preparations from transfected HN9.10 cells that constitutively expressed the mu opioid receptor.
Residue:398
BDBM50001026
NameBDBM50001026
Synonyms:3-But-2-ynyl-6,11-dimethyl-1,2,3,4,5,6-hexahydro-2,6-methano-benzo[d]azocin-8-ol | CHEMBL2367789
TypeSmall organic molecule
Emp. Form.C18H23NO
Mol. Mass.269.3813
SMILES[H][C@]12Cc3ccc(O)cc3[C@@](C)(CCN1CC#CC)[C@H]2C