Reaction Details
TargetMu-type opioid receptor
LigandBDBM50001046
Substrate/Competitorn/a
Meas. Tech.ChEBML_146540
Ki 4±n/a nM
Citation Carroll, FIAbraham, PParham, KBai, XZhang, XBrine, GAMascarella, SWMartin, BRMay, ELSauss, C Enantiomeric N-substituted N-normetazocines: a comparative study of affinities at sigma, PCP, and mu opioid receptors. J Med Chem35:2812-8 (1992) Mu-type opioid receptor
Name:Mu-type opioid receptor
Type:G Protein-Coupled Receptor (GPCR)
Mol. Mass.:44503.11
Organism:Rattus norvegicus (rat)
Description:Competition binding assays were carried out using membrane preparations from transfected HN9.10 cells that constitutively expressed the mu opioid receptor.
Residue:398
BDBM50001046
NameBDBM50001046
Synonyms:6,11-Dimethyl-3-(4-phenyl-butyl)-1,2,3,4,5,6-hexahydro-2,6-methano-benzo[d]azocin-8-ol | CHEMBL2367800
TypeSmall organic molecule
Emp. Form.C24H31NO
Mol. Mass.349.509
SMILES[H][C@]12Cc3ccc(O)cc3[C@@](C)(CCN1CCCCc1ccccc1)[C@H]2C