Reaction Details
TargetMu-type opioid receptor
LigandBDBM50001027
Substrate/Competitorn/a
Meas. Tech.ChEBML_146540
Ki 4.9±n/a nM
Citation Carroll, FIAbraham, PParham, KBai, XZhang, XBrine, GAMascarella, SWMartin, BRMay, ELSauss, C Enantiomeric N-substituted N-normetazocines: a comparative study of affinities at sigma, PCP, and mu opioid receptors. J Med Chem35:2812-8 (1992) Mu-type opioid receptor
Name:Mu-type opioid receptor
Type:G Protein-Coupled Receptor (GPCR)
Mol. Mass.:44503.11
Organism:Rattus norvegicus (rat)
Description:Competition binding assays were carried out using membrane preparations from transfected HN9.10 cells that constitutively expressed the mu opioid receptor.
Residue:398
BDBM50001027
NameBDBM50001027
Synonyms:3,6,11-Trimethyl-1,2,3,4,5,6-hexahydro-2,6-methano-benzo[d]azocin-8-ol | CHEMBL2367790
TypeSmall organic molecule
Emp. Form.C19H29NO
Mol. Mass.287.4397
SMILES[H][C@]12Cc3ccc(O)cc3[C@@](C)(CCN1CCC(C)C)[C@H]2C